Target
Kallikrein-7
Ligand
BDBM50598306
Substrate
Meas. Tech.
ChEMBL_2226674 (CHEMBL5140187)
Ki
10±n/a nM
Citation
 Gonschorek, PZorzi, AMaric, TLe Jeune, MSchüttel, MMontagnon, MGómez-Ojea, RVollmar, DPWhitfield, CReymond, LCarle, VVerma, HSchilling, OHovnanian, AHeinis, C Phage Display Selected Cyclic Peptide Inhibitors of Kallikrein-Related Peptidases 5 and 7 and Their  J Med Chem 65:9735-9749 (2022) Target
Name:
Kallikrein-7
Synonyms:
KLK7 Kallikrein 7 PRSS6 Serine protease 6 hK7 kallikrein-7 isoform 1 preproprotein
Type:
PROTEIN
Mol. Mass.:
27535.05
Organism:
Homo sapiens (Human)
Description:
ChEMBL_1469257
Residue:
253
  
Inhibitor
Name:
BDBM50598306
Synonyms:
CHEMBL5173148
Type:
Small organic molecule
Emp. Form.:
C46H72N12O13S3
Mol. Mass.:
1097.331
SMILES:
CSCC[C@@H]1NC(=O)[C@H](Cc2ccc(O)cc2)NC(=O)[C@H](CC(C)C)NC(=O)[C@H](CSCC(=O)CSC[C@H](NC(=O)[C@H](CCCNC(N)=N)NC(=O)[C@H](C)NC1=O)C(=O)N[C@@H](CO)C(O)=O)NC(=O)[C@@H]1CCCN1
: