Target
Kallikrein-7
Ligand
BDBM50598311
Substrate
Meas. Tech.
ChEMBL_2226674 (CHEMBL5140187)
Ki
7.0±n/a nM
Citation
 Gonschorek, PZorzi, AMaric, TLe Jeune, MSchüttel, MMontagnon, MGómez-Ojea, RVollmar, DPWhitfield, CReymond, LCarle, VVerma, HSchilling, OHovnanian, AHeinis, C Phage Display Selected Cyclic Peptide Inhibitors of Kallikrein-Related Peptidases 5 and 7 and Their  J Med Chem 65:9735-9749 (2022) Target
Name:
Kallikrein-7
Synonyms:
KLK7 Kallikrein 7 PRSS6 Serine protease 6 hK7 kallikrein-7 isoform 1 preproprotein
Type:
PROTEIN
Mol. Mass.:
27535.05
Organism:
Homo sapiens (Human)
Description:
ChEMBL_1469257
Residue:
253
  
Inhibitor
Name:
BDBM50598311
Synonyms:
CHEMBL5185665
Type:
Small organic molecule
Emp. Form.:
C147H208N26O43S2
Mol. Mass.:
3091.503
SMILES:
CCCCCCCCCCCCCCCC(=O)NCCCC[C@H](NC(=O)[C@H](CCC(O)=O)NC(=O)[C@H](Cc1ccc(O)cc1)NC(=O)[C@H](CCC(O)=O)NC(=O)COCCOCCNC(=O)c1ccc(c(c1)C(O)=O)-c1c2ccc(O)cc2oc2cc(=O)ccc12)C(=O)N[C@@H](CCC(O)=O)C(=O)N[C@@H](Cc1ccc(O)cc1)C(=O)N[C@@H](CCC(O)=O)C(=O)NCCOCCOCC(=O)NCCCC[C@H](NC(=O)CNC(=O)[C@@H]1CSCC(=O)CSC[C@H](NC(=O)[C@@H]2CCCN2)C(=O)N[C@@H](CC(C)C)C(=O)N[C@@H](Cc2ccc(O)cc2)C(=O)N[C@@H](CCCC)C(=O)N[C@@H](C)C(=O)N[C@@H](CCCNC(N)=N)C(=O)N1)C(=O)NCC(N)=O
: