Target
Tyrosine-protein kinase Fyn
Ligand
BDBM50175196
Substrate
Meas. Tech.
ChEMBL_328616 (CHEMBL864488)
IC50
44100±n/a nM
Citation
 Burchat, ABorhani, DWCalderwood, DJHirst, GCLi, BStachlewitz, RF Discovery of A-770041, a src-family selective orally active lck inhibitor that prevents organ allograft rejection. Bioorg Med Chem Lett 16:118-22 (2005)  
Target
Name:
Tyrosine-protein kinase Fyn
Synonyms:
FYN Proto-oncogene Syn SLK Src-like kinase | p59-Fyn
Type:
Enzyme
Mol. Mass.:
60762.21
Organism:
Homo sapiens (Human)
Description:
P06241
Residue:
537
  
Inhibitor
Name:
BDBM50175196
Synonyms:
A-770041 N-(4-(1-(4-(4-acetylpiperazin-1-yl)cyclohexyl)-4-amino-1H-pyrazolo[3,4-d]pyrimidin-3-yl)-2-methoxyphenyl)-1-methyl-1H-indole-2-carboxamide | N-(4-{1-[4-(4-ACETYLPIPERAZIN-1-YL)-TRANS-CYCLOHEXYL]-4-AMINO-1H-PYRAZOLO[3,4-D]PYRIMIDIN-3-YL}-2-METHOXYPHENYL)-1-METHYL-1H-INDOLE-2-CARBOXAMIDE
Type:
Small organic molecule
Emp. Form.:
C34H39N9O3
Mol. Mass.:
621.732
SMILES:
COc1cc(ccc1NC(=O)c1cc2ccccc2n1C)-c1nn([C@H]2CC[C@@H](CC2)N2CCN(CC2)C(C)=O)c2ncnc(N)c12
: