Target
Toll-like receptor 2
Ligand
BDBM50175653
Substrate
Meas. Tech.
ChEMBL_326942 (CHEMBL860291)
IC50
22000±n/a nM
Citation
 Spyvee, MRZhang, HHawkins, LDChow, JC Toll-like receptor 2 antagonists. Part 1: preliminary SAR investigation of novel synthetic phospholipids. Bioorg Med Chem Lett 15:5494-8 (2005)  
Target
Name:
Toll-like receptor 2
Synonyms:
TIL4 TLR2_HUMAN Toll-like receptor 2 (TLR2)
Type:
Protein
Mol. Mass.:
89837.58
Organism:
Homo sapiens (Human)
Description:
O60603
Residue:
784
  
Inhibitor
Name:
BDBM50175653
Synonyms:
CHEMBL200140 | Dodecanoic acid (R)-1-{2-[(S)-3-({2-[2-carboxy-3-(4-hydroxy-phenyl)-propionylamino]-ethoxy}-hydroxy-phosphoryloxy)-2-tetradecanoylamino-propoxy]-ethyl}-octyl ester
Type:
Small organic molecule
Emp. Form.:
C51H91N2O12P
Mol. Mass.:
955.2482
SMILES:
CCCCCCCCCCCCCC(=O)N[C@@H](COCC[C@@H](CCCCCCC)OC(=O)CCCCCCCCCCC)COP(O)(=O)OCCNC(=O)C(Cc1ccc(O)cc1)C(O)=O
: