Target
Type 1 fimbrin D-mannose specific adhesin
Ligand
BDBM50166886
Substrate
Meas. Tech.
ChEMBL_2227373 (CHEMBL5140886)
Kd
2200±n/a nM
Citation
 Singh, KKulkarni, SS Small Carbohydrate Derivatives as Potent Antibiofilm Agents. J Med Chem 65:8525-8549 (2022) Target
Name:
Type 1 fimbrin D-mannose specific adhesin
Synonyms:
Adhesin protein fimH fimH
Type:
PROTEIN
Mol. Mass.:
31474.61
Organism:
Escherichia coli (strain K12)
Description:
ChEMBL_1298296
Residue:
300
  
Inhibitor
Name:
BDBM50166886
Synonyms:
CHEMBL195368 | methyl alpha-D-mannoside
Type:
Small organic molecule
Emp. Form.:
C7H14O6
Mol. Mass.:
194.1825
SMILES:
CO[C@H]1O[C@H](CO)[C@@H](O)[C@H](O)[C@@H]1O
: