Target
Androgen receptor
Ligand
BDBM50068097
Substrate
Meas. Tech.
ChEMBL_2227393 (CHEMBL5140906)
EC50
0.320000±n/a nM
Citation
 Xiang, WWang, S Therapeutic Strategies to Target the Androgen Receptor. J Med Chem 65:8772-8797 (2022) Target
Name:
Androgen receptor
Synonyms:
ANDR_HUMAN Androgen Receptor Androgen receptor/Baculoviral IAP repeat-containing protein 2 Dihydrotestosterone receptor Nuclear receptor subfamily 3 group C member 4
Type:
Receptor
Mol. Mass.:
99185.27
Organism:
Homo sapiens (Human)
Description:
CHO cells were stably transfected with human AR gene.
Residue:
920
  
Inhibitor
Name:
BDBM50068097
Synonyms:
CHEMBL3402228
Type:
Small organic molecule
Emp. Form.:
C16H16N2O
Mol. Mass.:
252.311
SMILES:
C[C@H]1[C@@H](O)CCN1c1ccc(C#N)c2ccccc12
: