Target
Nuclear receptor subfamily 4 group A member 2
Ligand
BDBM50101853
Substrate
Meas. Tech.
ChEMBL_2227563 (CHEMBL5141076)
EC50
3000±n/a nM
Citation
 Willems, SMerk, D Medicinal Chemistry and Chemical Biology of Nurr1 Modulators: An Emerging Strategy in Neurodegeneration. J Med Chem 65:9548-9563 (2022) Target
Name:
Nuclear receptor subfamily 4 group A member 2
Synonyms:
NOT NR4A2_HUMAN TINUR
Type:
PROTEIN
Mol. Mass.:
66603.77
Organism:
Homo sapiens (Human)
Description:
ChEMBL_453027
Residue:
598
  
Inhibitor
Name:
BDBM50101853
Synonyms:
(11alpha,13E,15S)-11,15-dihydroxy-9-oxoprost-13-en-1-oic acid 11alpha,15alpha-dihydroxy-9-oxo-13-trans-prostenoic acid CHEMBL495 PGE1 | prostaglandin E1
Type:
Small organic molecule
Emp. Form.:
C20H34O5
Mol. Mass.:
354.481
SMILES:
CCCCC[C@H](O)\C=C\[C@H]1[C@H](O)CC(=O)[C@@H]1CCCCCCC(O)=O
: