Target
D(2) dopamine receptor
Ligand
BDBM50176450
Substrate
Meas. Tech.
ChEMBL_332997 (CHEMBL853595)
Ki
243±n/a nM
Citation
 Geneste, HBackfisch, GBraje, WDelzer, JHaupt, AHutchins, CWKing, LLLubisch, WSteiner, GTeschendorf, HJUnger, LWernet, W Synthesis and SAR of highly potent and selective dopamine D(3)-receptor antagonists: Quinolin(di)one and benzazepin(di)one derivatives. herve.geneste@abbott.com. Bioorg Med Chem Lett 16:658-62 (2005)  
Target
Name:
D(2) dopamine receptor
Synonyms:
D(2) dopamine receptor DOPAMINE D2 Long DRD2 Dopamine D2 receptor Dopamine D2 receptor (D2R) Dopamine2-like | d2
Type:
Cell-surface receptors
Mol. Mass.:
50647.10
Organism:
Homo sapiens (Human)
Description:
P14416
Residue:
443
  
Inhibitor
Name:
BDBM50176450
Synonyms:
1-(4-(4-(2-tert-butyl-6-(trifluoromethyl)pyrimidin-4-yl)piperazin-1-yl)butyl)-6-methoxy-4,5-dihydro-1H-benzo[b]azepin-2(3H)-one | CHEMBL202704
Type:
Small organic molecule
Emp. Form.:
C28H38F3N5O2
Mol. Mass.:
533.6288
SMILES:
COc1cccc2N(CCCCN3CCN(CC3)c3cc(nc(n3)C(C)(C)C)C(F)(F)F)C(=O)CCCc12
: