Target
Cholinesterase
Ligand
BDBM50599186
Substrate
Meas. Tech.
ChEMBL_2229104 (CHEMBL5142617)
Ki
0.094000±n/a nM
Citation
 Du, CWang, LGuan, QYang, HChen, TLiu, YLi, QLyu, WLu, XChen, YLiu, YLiu, HFeng, FLiu, WLiu, ZLi, WChen, YSun, H -Benzyl Benzamide Derivatives as Selective Sub-Nanomolar Butyrylcholinesterase Inhibitors for Possible Treatment in Advanced Alzheimer's Disease. J Med Chem 65:11365-11387 (2022) Target
Name:
Cholinesterase
Synonyms:
Acylcholine acylhydrolase Butyrylcholine esterase (BChE) Butyrylcholinesterase (BuChE) CHLE_HUMAN Cholinesterases Pseudocholinesterase
Type:
Homotetramer
Mol. Mass.:
68422.27
Organism:
Homo sapiens (Human)
Description:
P06276
Residue:
602
  
Inhibitor
Name:
BDBM50599186
Synonyms:
CHEMBL5201089
Type:
Small organic molecule
Emp. Form.:
C27H30FN3O2
Mol. Mass.:
447.5444
SMILES:
CCN(CC)Cc1ccccc1CNC(=O)c1cc(C)cc(NC(=O)c2ccc(F)cc2)c1
: