Target
Cannabinoid receptor 1
Ligand
BDBM50176989
Substrate
Meas. Tech.
ChEMBL_430951 (CHEMBL914893)
Ki
0.004±n/a nM
Citation
 Murineddu, GRuiu, SLoriga, GManca, ILazzari, PReali, RPani, LToma, LPinna, GA Tricyclic pyrazoles. 3. Synthesis, biological evaluation, and molecular modeling of analogues of the cannabinoid antagonist 8-chloro-1-(2',4'-dichlorophenyl)-N-piperidin-1-yl-1,4,5,6-tetrahydrobenzo[6,7]cyclohepta[1,2-c]pyrazole-3-carboxamide. J Med Chem 48:7351-62 (2005)  
Target
Name:
Cannabinoid receptor 1
Synonyms:
Brain-type cannabinoid receptor CB-R CNR1_MOUSE Cannabinoid receptor | Cnr1
Type:
Enzyme
Mol. Mass.:
52842.52
Organism:
Mus musculus (Mouse)
Description:
P47746
Residue:
473
  
Inhibitor
Name:
BDBM50176989
Synonyms:
8-chloro-1-(2',4'-dichlorophenyl)-N-pyrrolidin-1-yl-1,4,5,6-tetrahydrobenzo[6,7]cyclohepta[1,2-c]pyrazole-3-carboxamide | CHEMBL374933
Type:
Small organic molecule
Emp. Form.:
C23H21Cl3N4O
Mol. Mass.:
475.798
SMILES:
Clc1ccc(c(Cl)c1)-n1nc(C(=O)NN2CCCC2)c2CCCc3cc(Cl)ccc3-c12
: