Target
Ectonucleotide pyrophosphatase/phosphodiesterase family member 2
Ligand
BDBM50177329
Substrate
Meas. Tech.
ChEMBL_329851 (CHEMBL869921)
IC50
106±n/a nM
Citation
 Gududuru, VZeng, KTsukahara, RMakarova, NFujiwara, YPigg, KRBaker, DLTigyi, GMiller, DD Identification of Darmstoff analogs as selective agonists and antagonists of lysophosphatidic acid receptors. Bioorg Med Chem Lett 16:451-6 (2005)  
Target
Name:
Ectonucleotide pyrophosphatase/phosphodiesterase family member 2
Synonyms:
ATX Autotaxin (ATX) ENPP2 Ectonucleotide Pyrophosphatase/Phosphodiesterase 2 (ENPP2) Extracellular lysophospholipase D PDNP2
Type:
Enzyme
Mol. Mass.:
99007.13
Organism:
Homo sapiens (Human)
Description:
Q13822
Residue:
863
  
Inhibitor
Name:
BDBM50177329
Synonyms:
CHEMBL199380 | potassium (2-(6-(4-octylphenyl)hexyl)-1,3-dioxolan-4-yl)methyl hydrogenphosphate
Type:
Small organic molecule
Emp. Form.:
C24H40O6P
Mol. Mass.:
455.5451
SMILES:
CCCCCCCCc1ccc(CCCCCCC2OCC(COP(O)([O-])=O)O2)cc1
: