Target
Pro-cathepsin H
Ligand
BDBM50177501
Substrate
Meas. Tech.
ChEMBL_334150 (CHEMBL868301)
IC50
190±n/a nM
Citation
 Adkison, KKBarrett, DGDeaton, DNGampe, RTHassell, AMLong, STMcFadyen, RBMiller, ABMiller, LRPayne, JAShewchuk, LMWells-Knecht, KJWillard, DHWright, LL Semicarbazone-based inhibitors of cathepsin K, are they prodrugs for aldehyde inhibitors? Bioorg Med Chem Lett 16:978-83 (2006)  
Target
Name:
Pro-cathepsin H
Synonyms:
CATH_HUMAN CPSB Cathepsin H Cathepsin H light chain | Cathepsin H mini chain
Type:
PROTEIN
Mol. Mass.:
37402.31
Organism:
Homo sapiens (Human)
Description:
ChEMBL_1459870
Residue:
335
  
Inhibitor
Name:
BDBM50177501
Synonyms:
CHEMBL203663 | {(S)-1-[(morpholine-4-carbonyl)-hydrazonomethyl]-pentyl}-carbamic acid (R)-1-benzyl-2-methyl-propyl ester
Type:
Small organic molecule
Emp. Form.:
C23H36N4O4
Mol. Mass.:
432.5563
SMILES:
CCCC[C@H](NC(=O)O[C@H](Cc1ccccc1)C(C)C)C=NNC(=O)N1CCOCC1
: