Target
Receptor-interacting serine/threonine-protein kinase 1
Ligand
BDBM50229025
Substrate
Meas. Tech.
ChEMBL_2232289 (CHEMBL5146061)
IC50
298±n/a nM
Citation
 Niu, ALin, LZhang, DJiang, KWeng, DZhou, WWang, J Discovery of novel 2,8-diazaspiro[4.5]decan-1-one derivatives as potent RIPK1 kinase inhibitors. Bioorg Med Chem 59:0 (2022) Target
Name:
Receptor-interacting serine/threonine-protein kinase 1
Synonyms:
Cell death protein RIP RIP-1 RIPK1 Receptor-interacting protein 1
Type:
Enzyme Catalytic Domain
Mol. Mass.:
75926.99
Organism:
Homo sapiens (Human)
Description:
Q13546
Residue:
671
  
Inhibitor
Name:
BDBM50229025
Synonyms:
CHEMBL4092421
Type:
Small organic molecule
Emp. Form.:
C13H19NO2
Mol. Mass.:
221.2955
SMILES:
CCC(C)(C)C(=O)N(O)Cc1ccccc1
: