Target
Cyclin-dependent kinase 8
Ligand
BDBM50509567
Substrate
Meas. Tech.
ChEMBL_2232491 (CHEMBL5146263)
IC50
1.4±n/a nM
Citation
 Xie, ZHou, SYang, XDuan, YHan, JWang, QLiao, C Lessons Learned from Past Cyclin-Dependent Kinase Drug Discovery Efforts. J Med Chem 65:6356-6389 (2022) Target
Name:
Cyclin-dependent kinase 8
Synonyms:
CDK8 Cell division protein kinase 8 Mediator complex subunit CDK8 Protein kinase K35
Type:
Serine/threonine-protein kinase
Mol. Mass.:
53300.21
Organism:
Homo sapiens (Human)
Description:
P49336
Residue:
464
  
Inhibitor
Name:
BDBM50509567
Synonyms:
CHEMBL4455382 | US11213520, Example I-003
Type:
Small organic molecule
Emp. Form.:
C22H20N4O
Mol. Mass.:
356.4204
SMILES:
CN(C)C(=O)Cn1cc(cn1)-c1ccc(cc1)-c1cncc2ccccc12
: