Target
Cyclin-dependent kinase 9
Ligand
BDBM126500
Substrate
Meas. Tech.
ChEMBL_2232506 (CHEMBL5146278)
IC50
<0.500000±n/a nM
Citation
 Xie, ZHou, SYang, XDuan, YHan, JWang, QLiao, C Lessons Learned from Past Cyclin-Dependent Kinase Drug Discovery Efforts. J Med Chem 65:6356-6389 (2022) Target
Name:
Cyclin-dependent kinase 9
Synonyms:
C-2K CDK9 Cell division cycle 2-like protein kinase 4 Cyclin-Dependent Kinase 9 (CDK9) Serine/threonine-protein kinase PITALRE Tat-associated kinase complex catalytic subunit
Type:
Enzyme Subunit
Mol. Mass.:
42789.13
Organism:
Homo sapiens (Human)
Description:
Residue:
372
  
Inhibitor
Name:
BDBM126500
Synonyms:
US11591322, Compound NVP-2 | US8778951, 310
Type:
Small organic molecule
Emp. Form.:
C27H37ClN6O2
Mol. Mass.:
513.075
SMILES:
COC[C@@H](C)N[C@H]1CC[C@@H](CC1)Nc1cc(c(Cl)cn1)-c1cccc(NCC2(CCOCC2)C#N)n1
: