Target
Cyclin-dependent kinase 9
Ligand
BDBM50193093
Substrate
Meas. Tech.
ChEMBL_2232506 (CHEMBL5146278)
IC50
1.000000±n/a nM
Citation
 Xie, ZHou, SYang, XDuan, YHan, JWang, QLiao, C Lessons Learned from Past Cyclin-Dependent Kinase Drug Discovery Efforts. J Med Chem 65:6356-6389 (2022) Target
Name:
Cyclin-dependent kinase 9
Synonyms:
C-2K CDK9 Cell division cycle 2-like protein kinase 4 Cyclin-Dependent Kinase 9 (CDK9) Serine/threonine-protein kinase PITALRE Tat-associated kinase complex catalytic subunit
Type:
Enzyme Subunit
Mol. Mass.:
42789.13
Organism:
Homo sapiens (Human)
Description:
Residue:
372
  
Inhibitor
Name:
BDBM50193093
Synonyms:
RGB-286638
Type:
Small organic molecule
Emp. Form.:
C29H35N7O4
Mol. Mass.:
545.6327
SMILES:
COCCN1CCN(Cc2ccc(cc2)-c2n[nH]c3-c4cccc(NC(=O)NN5CCOCC5)c4C(=O)c23)CC1
: