Target
Cyclin-dependent kinase 8
Ligand
BDBM154576
Substrate
Meas. Tech.
ChEMBL_2232547 (CHEMBL5146319)
IC50
3.0±n/a nM
Citation
 Xie, ZHou, SYang, XDuan, YHan, JWang, QLiao, C Lessons Learned from Past Cyclin-Dependent Kinase Drug Discovery Efforts. J Med Chem 65:6356-6389 (2022) Target
Name:
Cyclin-dependent kinase 8
Synonyms:
CDK8 Cell division protein kinase 8 Mediator complex subunit CDK8 Protein kinase K35
Type:
Serine/threonine-protein kinase
Mol. Mass.:
53300.21
Organism:
Homo sapiens (Human)
Description:
P49336
Residue:
464
  
Inhibitor
Name:
BDBM154576
Synonyms:
K03861 (1)
Type:
Small organic molecule
Emp. Form.:
C24H26F3N7O2
Mol. Mass.:
501.5041
SMILES:
CN1CCN(Cc2ccc(NC(=O)Nc3ccc(Oc4ccnc(N)n4)cc3)cc2C(F)(F)F)CC1
: