Target
Holo-[acyl-carrier-protein] synthase
Ligand
BDBM50178647
Substrate
Meas. Tech.
ChEMBL_326222 (CHEMBL867576)
IC50
820±n/a nM
Citation
 Joseph-McCarthy, DParris, KHuang, AFailli, AQuagliato, DDushin, EGNovikova, ESeverina, ETuckman, MPetersen, PJDean, CFritz, CCMeshulam, TDeCenzo, MDick, LMcFadyen, IJSomers, WSLovering, FGilbert, AM Use of structure-based drug design approaches to obtain novel anthranilic acid acyl carrier protein synthase inhibitors. J Med Chem 48:7960-9 (2005)  
Target
Name:
Holo-[acyl-carrier-protein] synthase
Synonyms:
ACPS_BACSU acpS | ydcB
Type:
PROTEIN
Mol. Mass.:
13724.66
Organism:
Bacillus subtilis
Description:
ChEMBL_326222
Residue:
121
  
Inhibitor
Name:
BDBM50178647
Synonyms:
5-chloro-2-{[(9-oxo-9H-fluoren-4-yl)carbonyl]amino}-benzoic acid | CHEMBL371442
Type:
Small organic molecule
Emp. Form.:
C21H12ClNO4
Mol. Mass.:
377.777
SMILES:
OC(=O)c1cc(Cl)ccc1NC(=O)c1cccc2C(=O)c3ccccc3-c12
: