Target
Thyroid hormone receptor beta
Ligand
BDBM50178971
Substrate
Meas. Tech.
ChEMBL_338346 (CHEMBL866542)
IC50
0.26±n/a nM
Citation
 Garcia Collazo, AMKoehler, KFGarg, NFärnegårdh, MHusman, BYe, LLjunggren, JMellström, KSandberg, JGrynfarb, MAhola, HMalm, J Thyroid receptor ligands. Part 5: novel bicyclic agonist ligands selective for the thyroid hormone receptor beta. Bioorg Med Chem Lett 16:1240-4 (2006)  
Target
Name:
Thyroid hormone receptor beta
Synonyms:
ERBA2 Nuclear receptor subfamily 1 group A member 2 THR1 c-erbA-2 | c-erbA-beta
Type:
Receptor
Mol. Mass.:
52793.62
Organism:
Homo sapiens (Human)
Description:
Recombinant hThR was obtained from nuclear extracts from SF9 cells infected with baculovirus vectors encoding for ThRbeta 1.
Residue:
461
  
Inhibitor
Name:
BDBM50178971
Synonyms:
(R)-2-Amino-3-[4-(4-hydroxy-3-iodo-phenoxy)-3,5-diiodo-phenyl]-propionic acid 2-Amino-3-[4-(4-hydroxy-3-iodo-phenoxy)-3,5-diiodo-phenyl]-propionic acid Detrothyronine
Type:
Small organic molecule
Emp. Form.:
C15H12I3NO4
Mol. Mass.:
650.9735
SMILES:
N[C@H](Cc1cc(I)c(Oc2ccc(O)c(I)c2)c(I)c1)C(O)=O
: