Target
Thyroid hormone receptor alpha
Ligand
BDBM50241362
Substrate
Meas. Tech.
ChEMBL_338345 (CHEMBL866541)
IC50
3500±n/a nM
Citation
 Garcia Collazo, AMKoehler, KFGarg, NFärnegårdh, MHusman, BYe, LLjunggren, JMellström, KSandberg, JGrynfarb, MAhola, HMalm, J Thyroid receptor ligands. Part 5: novel bicyclic agonist ligands selective for the thyroid hormone receptor beta. Bioorg Med Chem Lett 16:1240-4 (2006)  
Target
Name:
Thyroid hormone receptor alpha
Synonyms:
C-erbA-alpha EAR7 NR1A1 THA_HUMAN THRA1 Thyroid Hormone Receptor (TR-alpha) Thyroid hormone receptor alpha c-erbA-1
Type:
Receptor
Mol. Mass.:
54818.00
Organism:
Homo sapiens (Human)
Description:
Recombinant hThR was obtained from nuclear extracts from SF9 cells infected with baculovirus vectors encoding for ThRalpha 1.
Residue:
490
  
Inhibitor
Name:
BDBM50241362
Synonyms:
5,7-dichloro-6-(4-hydroxy-3-isopropylphenoxy)-4-oxo-1,4-dihydroquinoline-2-carboxylic acid | CHEMBL250880
Type:
Small organic molecule
Emp. Form.:
C19H15Cl2NO5
Mol. Mass.:
408.232
SMILES:
CC(C)c1cc(Oc2c(Cl)cc3nc(cc(O)c3c2Cl)C(O)=O)ccc1O
: