Target
Thyroid hormone receptor beta
Ligand
BDBM50178972
Substrate
Meas. Tech.
ChEMBL_338350 (CHEMBL865335)
EC50
4.3±n/a nM
Citation
 Garcia Collazo, AMKoehler, KFGarg, NFärnegårdh, MHusman, BYe, LLjunggren, JMellström, KSandberg, JGrynfarb, MAhola, HMalm, J Thyroid receptor ligands. Part 5: novel bicyclic agonist ligands selective for the thyroid hormone receptor beta. Bioorg Med Chem Lett 16:1240-4 (2006)  
Target
Name:
Thyroid hormone receptor beta
Synonyms:
ERBA2 Nuclear receptor subfamily 1 group A member 2 THR1 c-erbA-2 | c-erbA-beta
Type:
Receptor
Mol. Mass.:
52793.62
Organism:
Homo sapiens (Human)
Description:
Recombinant hThR was obtained from nuclear extracts from SF9 cells infected with baculovirus vectors encoding for ThRbeta 1.
Residue:
461
  
Inhibitor
Name:
BDBM50178972
Synonyms:
4,6-dibromo-5-(4-hydroxy-3-isopropylphenoxy)-2,3-dihydro-1H-indene-2-carboxylic acid | CHEMBL203828
Type:
Small organic molecule
Emp. Form.:
C19H18Br2O4
Mol. Mass.:
470.152
SMILES:
CC(C)c1cc(Oc2c(Br)cc3CC(Cc3c2Br)C(O)=O)ccc1O
: