Target
Retinoic acid receptor RXR-alpha
Ligand
BDBM50179123
Substrate
Meas. Tech.
ChEMBL_349697 (CHEMBL866288)
Ki
257±n/a nM
Citation
 Farmer, LJMarron, KSCanan Koch, SSHwang, CKKallel, EAZhi, LNadzan, AMRobertson, DWBennani, YL Aza-retinoids as novel retinoid X receptor-specific agonists. Bioorg Med Chem Lett 16:2352-6 (2006)  
Target
Name:
Retinoic acid receptor RXR-alpha
Synonyms:
NR2B1 Nuclear receptor subfamily 4 group A member 2 RXRA Retinoic acid receptor RXR-alpha/gamma Retinoid receptor
Type:
PROTEIN
Mol. Mass.:
50820.38
Organism:
Homo sapiens (Human)
Description:
ChEMBL_1456363
Residue:
462
  
Inhibitor
Name:
BDBM50179123
Synonyms:
(2E,4E)-6-((3-methoxy-5,5,8,8-tetramethyl-5,6,7,8-tetrahydronaphthalen-2-yl)(propyl)amino)-3-methylhexa-2,4-dienoic acid | CHEMBL204773
Type:
Small organic molecule
Emp. Form.:
C25H37NO3
Mol. Mass.:
399.5662
SMILES:
CCCN(C\C=C\C(\C)=C\C(O)=O)c1cc2c(cc1OC)C(C)(C)CCC2(C)C
: