Target
Delta-type opioid receptor
Ligand
BDBM50001468
Substrate
Meas. Tech.
ChEMBL_325354 (CHEMBL861054)
Ki
0.24±n/a nM
Citation
 Balboni, GGuerrini, RSalvadori, SNegri, LGiannini, EBryant, SDJinsmaa, YLazarus, LH Conversion of the potent delta-opioid agonist H-Dmt-Tic-NH-CH(2)-bid into delta-opioid antagonists by N(1)-benzimidazole alkylation(1). J Med Chem 48:8112-4 (2005)  
Target
Name:
Delta-type opioid receptor
Synonyms:
Cytochrome P450 3A4 Delta opioid receptor Delta-type opioid receptor (DOR) OPRD_RAT Opioid receptor Opioid receptors; mu & delta Ror-a | Voltage-gated potassium channel
Type:
G Protein-Coupled Receptor (GPCR)
Mol. Mass.:
40465.04
Organism:
Rattus norvegicus (rat)
Description:
Competition binding assays were using CHO-K1 cell membranes expressing the opioid receptor.
Residue:
372
  
Inhibitor
Name:
BDBM50001468
Synonyms:
(S)-3-((S)-2-{(R)-2-[(S)-2-Amino-3-(4-hydroxy-phenyl)-propionylamino]-propionylamino}-3-phenyl-propionylamino)-N-{(S)-1-[(S)-1-(carbamoylmethyl-carbamoyl)-2-methyl-propylcarbamoyl]-2-methyl-propyl}-succinamic acid CHEMBL317956 deltorphin C
Type:
Small organic molecule
Emp. Form.:
C37H52N8O10
Mol. Mass.:
768.8564
SMILES:
CC(C)[C@H](NC(=O)[C@@H](NC(=O)[C@H](CC(O)=O)NC(=O)[C@H](Cc1ccccc1)NC(=O)[C@@H](C)NC(=O)[C@@H](N)Cc1ccc(O)cc1)C(C)C)C(=O)NCC(N)=O
: