Target
Cyclin-dependent kinase 4
Ligand
BDBM50179207
Substrate
Meas. Tech.
ChEMBL_325229 (CHEMBL861590)
IC50
>100000±n/a nM
Citation
 Ho, CYLudovici, DWMaharoof, USMei, JSechler, JLTuman, RWStrobel, EDAndraka, LYen, HKLeo, GLi, JAlmond, HLu, HDeVine, ATominovich, RMBaker, JEmanuel, SGruninger, RHMiddleton, SAJohnson, DLGalemmo, RA (6,7-Dimethoxy-2,4-dihydroindeno[1,2-c]pyrazol-3-yl)phenylamines: platelet-derived growth factor receptor tyrosine kinase inhibitors with broad antiproliferative activity against tumor cells. J Med Chem 48:8163-73 (2005)  
Target
Name:
Cyclin-dependent kinase 4
Synonyms:
CDK4 Cell division protein kinase 4 PSK-J3
Type:
Enzyme Subunit
Mol. Mass.:
33731.96
Organism:
Homo sapiens (Human)
Description:
P11802
Residue:
303
  
Inhibitor
Name:
BDBM50179207
Synonyms:
3-fluoro-N-(6,7-dimethoxy-2,4-dihydroindeno[1,2-c]pyrazol-3-yl)phenylamine JNJ-10198409
Type:
Small organic molecule
Emp. Form.:
C18H16FN3O2
Mol. Mass.:
325.3369
SMILES:
COc1cc2Cc3c(Nc4cccc(F)c4)[nH]nc3-c2cc1OC
: