Target
Platelet-derived growth factor receptor alpha
Ligand
BDBM50179207
Substrate
Meas. Tech.
ChEMBL_325221 (CHEMBL861475)
IC50
45±n/a nM
Citation
 Ho, CYLudovici, DWMaharoof, USMei, JSechler, JLTuman, RWStrobel, EDAndraka, LYen, HKLeo, GLi, JAlmond, HLu, HDeVine, ATominovich, RMBaker, JEmanuel, SGruninger, RHMiddleton, SAJohnson, DLGalemmo, RA (6,7-Dimethoxy-2,4-dihydroindeno[1,2-c]pyrazol-3-yl)phenylamines: platelet-derived growth factor receptor tyrosine kinase inhibitors with broad antiproliferative activity against tumor cells. J Med Chem 48:8163-73 (2005)  
Target
Name:
Platelet-derived growth factor receptor alpha
Synonyms:
Alpha-type platelet-derived growth factor receptor PDGFRA PGFRA_HUMAN Platelet-derived growth factor receptor alpha (PDGFRA) RHEPDGFRA
Type:
Protein
Mol. Mass.:
122633.38
Organism:
Homo sapiens (Human)
Description:
P16234
Residue:
1089
  
Inhibitor
Name:
BDBM50179207
Synonyms:
3-fluoro-N-(6,7-dimethoxy-2,4-dihydroindeno[1,2-c]pyrazol-3-yl)phenylamine JNJ-10198409
Type:
Small organic molecule
Emp. Form.:
C18H16FN3O2
Mol. Mass.:
325.3369
SMILES:
COc1cc2Cc3c(Nc4cccc(F)c4)[nH]nc3-c2cc1OC
: