Target
Vascular endothelial growth factor A
Ligand
BDBM50179255
Substrate
Meas. Tech.
ChEMBL_325520 (CHEMBL859219)
Kd
7.1±n/a nM
Citation
 Karoli, TLiu, LFairweather, JKHammond, ELi, CPCochran, SBergefall, KTrybala, EAddison, RSFerro, V Synthesis, biological activity, and preliminary pharmacokinetic evaluation of analogues of a phosphosulfomannan angiogenesis inhibitor (PI-88). J Med Chem 48:8229-36 (2005)  
Target
Name:
Vascular endothelial growth factor A
Synonyms:
VEGF VEGFA VPF Vascular endothelial growth factor A (VEGF) Vascular permeability factor
Type:
Protein
Mol. Mass.:
27063.81
Organism:
Homo sapiens (Human)
Description:
P15692
Residue:
395
  
Inhibitor
Name:
BDBM50179255
Synonyms:
CHEMBL265885 | N-[(2S,3S,4S,5S,6R)-3-{[(2R,3S,4S,5R,6R)-4-{[(2R,3S,4S,5R,6R)-4-{[(2R,3S,4S,5R,6R)-3,5-dihydroxy-6-(hydroxymethyl)-4-{[(2R,3S,4S,5S,6R)-3,4,5-trihydroxy-6-(hydroxymethyl)oxan-2-yl]oxy}oxan-2-yl]oxy}-3,5-dihydroxy-6-(hydroxymethyl)oxan-2-yl]oxy}-3,5-dihydroxy-6-(hydroxymethyl)oxan-2-yl]oxy}-4,5-dihydroxy-6-(hydroxymethyl)oxan-2-yl]-2-phenoxyacetamide
Type:
Small organic molecule
Emp. Form.:
C38H59NO27
Mol. Mass.:
961.8656
SMILES:
OC[C@H]1O[C@H](NC(=O)COc2ccccc2)[C@@H](O[C@H]2O[C@H](CO)[C@@H](O)[C@H](O[C@H]3O[C@H](CO)[C@@H](O)[C@H](O[C@H]4O[C@H](CO)[C@@H](O)[C@H](O[C@H]5O[C@H](CO)[C@@H](O)[C@H](O)[C@@H]5O)[C@@H]4O)[C@@H]3O)[C@@H]2O)[C@@H](O)[C@@H]1O
: