Target
Heparanase
Ligand
BDBM50179253
Substrate
Meas. Tech.
ChEMBL_325521 (CHEMBL860314)
IC50
1640±n/a nM
Citation
 Karoli, TLiu, LFairweather, JKHammond, ELi, CPCochran, SBergefall, KTrybala, EAddison, RSFerro, V Synthesis, biological activity, and preliminary pharmacokinetic evaluation of analogues of a phosphosulfomannan angiogenesis inhibitor (PI-88). J Med Chem 48:8229-36 (2005)  
Target
Name:
Heparanase
Synonyms:
Endo-glucoronidase HPA HPR1 HPSE1 HSE1 Heparanase 8 kDa subunit | Heparanase-1
Type:
PROTEIN
Mol. Mass.:
61167.67
Organism:
Homo sapiens (Human)
Description:
ChEMBL_327900
Residue:
543
  
Inhibitor
Name:
BDBM50179253
Synonyms:
(2R,3S,4S,5S,6R)-2-{[(2R,3S,4S,5R,6R)-2-{[(2R,3S,4S,5R,6R)-2-{[(2R,3S,4S,5R,6R)-2-{[(2S,3S,4S,5S,6R)-4,5-dihydroxy-6-(hydroxymethyl)-2-(octyloxy)oxan-3-yl]oxy}-3,5-dihydroxy-6-(hydroxymethyl)oxan-4-yl]oxy}-3,5-dihydroxy-6-(hydroxymethyl)oxan-4-yl]oxy}-3,5-dihydroxy-6-(hydroxymethyl)oxan-4-yl]oxy}-6-(hydroxymethyl)oxane-3,4,5-triol | CHEMBL198643
Type:
Small organic molecule
Emp. Form.:
C38H68O26
Mol. Mass.:
940.9309
SMILES:
CCCCCCCCO[C@H]1O[C@H](CO)[C@@H](O)[C@H](O)[C@@H]1O[C@H]1O[C@H](CO)[C@@H](O)[C@H](O[C@H]2O[C@H](CO)[C@@H](O)[C@H](O[C@H]3O[C@H](CO)[C@@H](O)[C@H](O[C@H]4O[C@H](CO)[C@@H](O)[C@H](O)[C@@H]4O)[C@@H]3O)[C@@H]2O)[C@@H]1O
: