Target
Protein disulfide-isomerase
Ligand
BDBM50049391
Substrate
Meas. Tech.
ChEMBL_2234112 (CHEMBL5147884)
Ki
5900±n/a nM
Citation
 Liang, CCai, MXu, YFu, WWu, JLiu, YLiao, XNing, JLi, JHuang, MYuan, C Identification of Antithrombotic Natural Products Targeting the Major Substrate Binding Pocket of Protein Disulfide Isomerase. J Nat Prod 85:1332-1339 (2022) Target
Name:
Protein disulfide-isomerase
Synonyms:
Cellular thyroid hormone-binding protein P4HB PDIA1 PO4DB | Protein Disulfide-Isomerase (PDI)
Type:
Protein
Mol. Mass.:
57084.91
Organism:
Homo sapiens (Human)
Description:
P07237
Residue:
508
  
Inhibitor
Name:
BDBM50049391
Synonyms:
3,5,7-Trihydroxyflavone 3,5,7-trihydroxy-2-phenyl-4H-benzopyran-4-one CHEMBL309490 Galangin (15) cid_5281616 | norizalpinin
Type:
Small organic molecule
Emp. Form.:
C15H10O5
Mol. Mass.:
270.2369
SMILES:
Oc1cc(O)c2c(c1)oc(-c1ccccc1)c(O)c2=O
: