Target
Voltage-dependent calcium channel subunit alpha-2/delta-1
Ligand
BDBM50179703
Substrate
Meas. Tech.
ChEMBL_335548 (CHEMBL859414)
Ki
4.3±n/a nM
Citation
 Mortell, KHAnderson, DJLynch, JJNelson, SLSarris, KMcDonald, HSabet, RBaker, SHonore, PLee, CHJarvis, MFGopalakrishnan, M Structure-activity relationships of alpha-amino acid ligands for the alpha2delta subunit of voltage-gated calcium channels. Bioorg Med Chem Lett 16:1138-41 (2006)  
Target
Name:
Voltage-dependent calcium channel subunit alpha-2/delta-1
Synonyms:
CA2D1_MOUSE Cacna2d1 | Voltage-gated calcium channel alpha2/delta subunit 1
Type:
PROTEIN
Mol. Mass.:
124608.02
Organism:
Mus musculus
Description:
ChEMBL_335548
Residue:
1103
  
Inhibitor
Name:
BDBM50179703
Synonyms:
4-(4-chlorobenzylthio)-2-aminobutanoic acid | CHEMBL377079
Type:
Small organic molecule
Emp. Form.:
C11H14ClNO2S
Mol. Mass.:
259.752
SMILES:
NC(CCSCc1ccc(Cl)cc1)C(O)=O
: