Target
Dual specificity tyrosine-phosphorylation-regulated kinase 1B
Ligand
BDBM50600509
Substrate
Meas. Tech.
ChEMBL_2234411 (CHEMBL5148183)
Ki
1105±n/a nM
Citation
 Segretti, NDTakarada, JEFerreira, MAda Silva Santiago, ATeodoro, BVMDamião, MCFCBGodoi, PHCunha, MRFala, AMRamos, PZIshikawa, EEMascarello, ASerafim, RAMAzevedo, HGuimarães, CRWCouñago, RM Discovery of novel benzothiophene derivatives as potent and narrow spectrum inhibitors of DYRK1A and DYRK1B. Bioorg Med Chem Lett 68:0 (2022) Target
Name:
Dual specificity tyrosine-phosphorylation-regulated kinase 1B
Synonyms:
DYR1B_HUMAN Dual specificity tyrosine-phosphorylation-regulated kinase 1B MIRK
Type:
Enzyme
Mol. Mass.:
69222.24
Organism:
Homo sapiens (Human)
Description:
Q9Y463
Residue:
629
  
Inhibitor
Name:
BDBM50600509
Synonyms:
CHEMBL5170875
Type:
Small organic molecule
Emp. Form.:
C19H18N2O3S2
Mol. Mass.:
386.488
SMILES:
NC(=O)c1cc2c(cccc2s1)-c1ccc(s1)C(=O)NC1CCOCC1
: