Target
Gamma-aminobutyric acid receptor subunit alpha-3/beta-3/gamma-2
Ligand
BDBM50179854
Substrate
Meas. Tech.
ChEMBL_340783 (CHEMBL869460)
Ki
3.4±n/a nM
Citation
 Goodacre, SCHallett, DJCarling, RWCastro, JLReynolds, DSPike, AWafford, KANewman, RAtack, JRStreet, LJ Imidazo[1,2-a]pyrazin-8-ones, imidazo[1,2-d][1,2,4]triazin-8-ones and imidazo[2,1-f][1,2,4]triazin-8-ones as alpha2/alpha3 subtype selective GABA A agonists for the treatment of anxiety. Bioorg Med Chem Lett 16:1582-5 (2006)  
Target
Name:
Gamma-aminobutyric acid receptor subunit alpha-3/beta-3/gamma-2
Synonyms:
GABA receptor alpha-3/beta-3/gamma-2 subunit | GABA-A receptor; alpha-3/beta-3/gamma-2
Type:
Mol. Mass.:
Description:
ASSAY_ID of EBI is 68410
Components:
This complex has 3 components.
Component 1
Name:
Gamma-aminobutyric acid receptor subunit gamma-2
Synonyms:
GABA(A) receptor subunit gamma-2 GBRG2_HUMAN
Type:
PROTEIN
Mol. Mass.:
54172.74
Organism:
Homo sapiens (Human)
Description:
EBI_217
Residue:
467
  
Component 2
Name:
Gamma-aminobutyric acid receptor subunit beta-3
Synonyms:
GABA A receptor alpha-4/beta-3/gamma-2 GABA-A receptor GBRB3_HUMAN | agonist GABA site
Type:
PROTEIN
Mol. Mass.:
54130.51
Organism:
Homo sapiens (Human)
Description:
ChEMBL_448071
Residue:
473
  
Component 3
Name:
Gamma-aminobutyric acid receptor subunit alpha-3
Synonyms:
GABA A Alpha3Beta3Gamma2 GABA C GABA-A receptor GBRA3_HUMAN agonist GABA site
Type:
Enzyme Catalytic Domain
Mol. Mass.:
55175.47
Organism:
Homo sapiens (Human)
Description:
GABA A Alpha3Beta1Gamma2 0 HUMAN::P34903
Residue:
492
  
Inhibitor
Name:
BDBM50179854
Synonyms:
5'-(7-ethyl-8-oxo-7,8-dihydroimidazo[1,2-d][1,2,4]triazin-3-yl)-2',4-difluoro-1,1'-biphenyl-2-carbonitrile | CHEMBL203877
Type:
Small organic molecule
Emp. Form.:
C20H13F2N5O
Mol. Mass.:
377.3469
SMILES:
CCn1ncn2c(cnc2c1=O)-c1ccc(F)c(c1)-c1ccc(F)cc1C#N
: