Target
Protein c-Fos/Transcription factor Jun
Ligand
BDBM50180050
Substrate
Meas. Tech.
ChEMBL_329856 (CHEMBL870577)
IC50
420000±n/a nM
Citation
 Tsuchida, KChaki, HTakakura, TKotsubo, HTanaka, TAikawa, YShiozawa, SHirono, S Discovery of nonpeptidic small-molecule AP-1 inhibitors: lead hopping based on a three-dimensional pharmacophore model. J Med Chem 49:80-91 (2006)  
Target
Name:
Protein c-Fos/Transcription factor Jun
Synonyms:
Proto-oncogene c-JUN/protein c-fos | Transcription factor AP1
Type:
Mol. Mass.:
Description:
ASSAY_ID of EBI is 305353
Components:
This complex has 2 components.
Component 1
Name:
Transcription factor Jun
Synonyms:
AP1 JUN Proto-oncogene c-JUN Transcription factor AP1 p39
Type:
Mol. Mass.:
35683.24
Organism:
Homo sapiens (Human)
Description:
P05412
Residue:
331
  
Component 2
Name:
Protein c-Fos
Synonyms:
FOS G0S7 | Transcription factor AP1
Type:
PROTEIN
Mol. Mass.:
40679.34
Organism:
Homo sapiens (Human)
Description:
EBI_100167
Residue:
380
  
Inhibitor
Name:
BDBM50180050
Synonyms:
3-[2-benzyloxy-5-(4-isobutoxybenzoyl)phenyl]propionic acid | CHEMBL200031
Type:
Small organic molecule
Emp. Form.:
C27H28O5
Mol. Mass.:
432.5082
SMILES:
CC(C)COc1ccc(cc1)C(=O)c1ccc(OCc2ccccc2)c(CCC(O)=O)c1
: