Target
Heat shock protein HSP 90-beta
Ligand
BDBM50180302
Substrate
Meas. Tech.
ChEMBL_329524 (CHEMBL859807)
EC50
10.2±n/a nM
Citation
 He, HZatorska, DKim, JAguirre, JLlauger, LShe, YWu, NImmormino, RMGewirth, DTChiosis, G Identification of potent water soluble purine-scaffold inhibitors of the heat shock protein 90. J Med Chem 49:381-90 (2006)  
Target
Name:
Heat shock protein HSP 90-beta
Synonyms:
HS90B_HUMAN HSP 90 HSP90B HSPCB Heat shock protein HSP 90 (Hsp90)
Type:
Molecular Chaperone
Mol. Mass.:
83229.45
Organism:
Homo sapiens (Human)
Description:
P08238
Residue:
724
  
Inhibitor
Name:
BDBM50180302
Synonyms:
8-(6-iodo-benzo[1,3]dioxol-5-ylsulfanyl)-9-(3-isopropylamino-propyl)adenine 8-[(6-IODO-1,3-BENZODIOXOL-5-YL)THIO]-9-[3-(ISOPROPYLAMINO)PROPYL]-9H-PURIN-6-AMINE US10336757, Compound PU-H71 | US10676476, Example 9
Type:
Small organic molecule
Emp. Form.:
C18H21IN6O2S
Mol. Mass.:
512.368
SMILES:
CC(C)NCCCn1c(Sc2cc3OCOc3cc2I)nc2c(N)ncnc12
: