Target
Gonadotropin-releasing hormone receptor
Ligand
BDBM50180788
Substrate
Meas. Tech.
ChEMBL_327259 (CHEMBL865158)
IC50
1.3±n/a nM
Citation
 Betz, SFReinhart, GJLio, FMChen, CStruthers, RS Overlapping, nonidentical binding sites of different classes of nonpeptide antagonists for the human gonadotropin-releasing hormone receptor. J Med Chem 49:637-47 (2006)  
Target
Name:
Gonadotropin-releasing hormone receptor
Synonyms:
GNRHR GRHR GnRH-R Gonadotropin-releasing hormone receptor | Gonadotropin-releasing hormone receptor (GnRH)
Type:
Enzyme
Mol. Mass.:
37749.45
Organism:
Homo sapiens (Human)
Description:
P30968
Residue:
328
  
Inhibitor
Name:
BDBM50180788
Synonyms:
CHEMBL265775 | pGlu-His-Trp-Ser-Tyr-Gly-Leu-Arg-Pro-Gly-NH2
Type:
Small organic molecule
Emp. Form.:
C59H80N18O15
Mol. Mass.:
1281.3781
SMILES:
CC(C)C[C@H](NC(=O)[C@@H](Cc1ccc(O)cc1)NC(=O)[C@H](Cc1cnc[nH]1)NC(=O)[C@H](CO)NC(=O)[C@H](Cc1c[nH]c2ccccc12)NC(=O)[C@H](Cc1cnc[nH]1)NC(=O)[C@@H](N)CCC(O)=O)C(=O)N[C@@H](CCCN=C(N)N)C(=O)N1CCC[C@H]1C(=O)NCC(O)=O
: