Target
Collagenase 3
Ligand
BDBM50180995
Substrate
Meas. Tech.
ChEMBL_339181 (CHEMBL867737)
IC50
8±n/a nM
Citation
 Levin, JIChen, JMLaakso, LMDu, MSchmid, JXu, WCummons, TXu, JJin, GBarone, DSkotnicki, JS Acetylenic TACE inhibitors. Part 3: Thiomorpholine sulfonamide hydroxamates. Bioorg Med Chem Lett 16:1605-9 (2006)  
Target
Name:
Collagenase 3
Synonyms:
MMP-13 MMP13_HUMAN Matrix metalloproteinase-13 (MMP-13) | Matrix metalloproteinase-13 (MMP13)
Type:
Enzyme
Mol. Mass.:
53808.06
Organism:
Homo sapiens (Human)
Description:
P45452
Residue:
471
  
Inhibitor
Name:
BDBM50180995
Synonyms:
(S)-4-(4-(4-aminobut-2-ynyloxy)phenylsulfonyl)-N-hydroxy-2,2-dimethylthiomorpholine-3-carboxamide CHEMBL202839
Type:
Small organic molecule
Emp. Form.:
C17H23N3O5S2
Mol. Mass.:
413.512
SMILES:
CC1(C)SCCN([C@H]1C(=O)NO)S(=O)(=O)c1ccc(OCC#CCN)cc1
: