Target
Thymidylate synthase
Ligand
BDBM50027656
Substrate
Meas. Tech.
ChEMBL_2236554 (CHEMBL5150450)
Ki
1.3±n/a nM
Citation
 Wang, SYuan, XHWang, SQZhao, WChen, XBYu, B FDA-approved pyrimidine-fused bicyclic heterocycles for cancer therapy: Synthesis and clinical application. Eur J Med Chem 214:0 (2021) Target
Name:
Thymidylate synthase
Synonyms:
TS TYMS Thymidylate synthase (TS) | Thymidylate synthase/GAR transformylase/AICAR transformylase
Type:
Enzyme
Mol. Mass.:
35718.07
Organism:
Homo sapiens (Human)
Description:
Residue:
313
  
Inhibitor
Name:
BDBM50027656
Synonyms:
CHEBI:63616 LY-231514 US9422297, Pemetrexed
Type:
Small organic molecule
Emp. Form.:
C20H21N5O6
Mol. Mass.:
427.4106
SMILES:
Nc1nc2[nH]cc(CCc3ccc(cc3)C(=O)N[C@@H](CCC(O)=O)C(O)=O)c2c(=O)[nH]1
: