Target
Kinesin-like protein KIF11
Ligand
BDBM50181138
Substrate
Meas. Tech.
ChEMBL_345008 (CHEMBL868957)
IC50
1.2±n/a nM
Citation
 Garbaccio, RMFraley, METasber, ESOlson, CMHoffman, WFArrington, KLTorrent, MBuser, CAWalsh, ESHamilton, KSchaber, MDFernandes, CLobell, RBTao, WSouth, VJYan, YKuo, LCPrueksaritanont, TSlaughter, DEShu, CHeimbrook, DCKohl, NEHuber, HEHartman, GD Kinesin spindle protein (KSP) inhibitors. Part 3: synthesis and evaluation of phenolic 2,4-diaryl-2,5-dihydropyrroles with reduced hERG binding and employment of a phosphate prodrug strategy for aqueous solubility. Bioorg Med Chem Lett 16:1780-3 (2006)  
Target
Name:
Kinesin-like protein KIF11
Synonyms:
EG5 KIF11_HUMAN Kinesin Spindle Protein Eg5 TRIP5 | kinesin spindle protein
Type:
PROTEIN
Mol. Mass.:
119138.97
Organism:
Homo sapiens (Human)
Description:
ChEMBL_1457426
Residue:
1056
  
Inhibitor
Name:
BDBM50181138
Synonyms:
(S)-2-amino-1-((S)-4-(2,5-difluorophenyl)-2-(3-hydroxyphenyl)-2H-pyrrol-1(5H)-yl)-3-methylbutan-1-one | CHEMBL381526
Type:
Small organic molecule
Emp. Form.:
C21H22F2N2O2
Mol. Mass.:
372.4084
SMILES:
CC(C)[C@H](N)C(=O)N1CC(=C[C@H]1c1cccc(O)c1)c1cc(F)ccc1F
: