Target
NEDD8-activating enzyme E1 catalytic subunit
Ligand
BDBM50601482
Substrate
Meas. Tech.
ChEMBL_2237123 (CHEMBL5151019)
IC50
6.1±n/a nM
Citation
 Xiong, CZhou, LTan, JSong, SBao, XZhang, NDing, HZhao, JHe, JXMiao, ZHZhang, A Development of Potent NEDD8-Activating Enzyme Inhibitors Bearing a Pyrimidotriazole Scaffold. J Med Chem 64:6161-6178 (2021) Target
Name:
NEDD8-activating enzyme E1 catalytic subunit
Synonyms:
6.2.1.- NEDD8-activating enzyme E1C UBA3_HUMAN Ubiquitin-activating enzyme 3 Ubiquitin-like modifier-activating enzyme 3
Type:
PROTEIN
Mol. Mass.:
51843.76
Organism:
Homo sapiens
Description:
ChEMBL_116863
Residue:
463
  
Inhibitor
Name:
BDBM50601482
Synonyms:
CHEMBL5177700
Type:
Small organic molecule
Emp. Form.:
C17H20FN7O4S
Mol. Mass.:
437.449
SMILES:
NS(=O)(=O)OC[C@@H]1C[C@H](C[C@@H]1O)n1nnc2c(NCc3ccccc3F)ncnc12
: