Target
Fructose-1,6-bisphosphatase 1
Ligand
BDBM50181354
Substrate
Meas. Tech.
ChEMBL_345422 (CHEMBL861116)
IC50
>50000±n/a nM
Citation
 Lai, CGum, RJDaly, MFry, EHHutchins, CAbad-Zapatero, Cvon Geldern, TW Benzoxazole benzenesulfonamides as allosteric inhibitors of fructose-1,6-bisphosphatase. Bioorg Med Chem Lett 16:1807-10 (2006)  
Target
Name:
Fructose-1,6-bisphosphatase 1
Synonyms:
D-fructose-1,6-bisphosphate 1-phosphohydrolase 1 FBP FBPase 1 Fructose-1,6-bisphosphatase 1 | Fructose-1,6-bisphosphatase 1 (FBPase)
Type:
Protein
Mol. Mass.:
36843.58
Organism:
Homo sapiens (Human)
Description:
Liver FBPase (P09467)
Residue:
338
  
Inhibitor
Name:
BDBM50181354
Synonyms:
CHEMBL205376 | N-(5-chlorobenzo[d]oxazol-2-yl)butane-1-sulfonamide
Type:
Small organic molecule
Emp. Form.:
C11H13ClN2O3S
Mol. Mass.:
288.751
SMILES:
CCCCS(=O)(=O)Nc1nc2cc(Cl)ccc2o1
: