Target
Fructose-1,6-bisphosphatase 1
Ligand
BDBM50181327
Substrate
Meas. Tech.
ChEMBL_345422 (CHEMBL861116)
IC50
2500±n/a nM
Citation
 Lai, CGum, RJDaly, MFry, EHHutchins, CAbad-Zapatero, Cvon Geldern, TW Benzoxazole benzenesulfonamides as allosteric inhibitors of fructose-1,6-bisphosphatase. Bioorg Med Chem Lett 16:1807-10 (2006)  
Target
Name:
Fructose-1,6-bisphosphatase 1
Synonyms:
D-fructose-1,6-bisphosphate 1-phosphohydrolase 1 FBP FBPase 1 Fructose-1,6-bisphosphatase 1 | Fructose-1,6-bisphosphatase 1 (FBPase)
Type:
Protein
Mol. Mass.:
36843.58
Organism:
Homo sapiens (Human)
Description:
Liver FBPase (P09467)
Residue:
338
  
Inhibitor
Name:
BDBM50181327
Synonyms:
CHEMBL381594 | N-(5-chlorobenzo[d]oxazol-2-yl)naphthalene-2-sulfonamide
Type:
Small organic molecule
Emp. Form.:
C17H11ClN2O3S
Mol. Mass.:
358.799
SMILES:
Clc1ccc2oc(NS(=O)(=O)c3ccc4ccccc4c3)nc2c1
: