Target
Fructose-1,6-bisphosphatase 1
Ligand
BDBM50181351
Substrate
Meas. Tech.
ChEMBL_345422 (CHEMBL861116)
IC50
8000±n/a nM
Citation
 Lai, CGum, RJDaly, MFry, EHHutchins, CAbad-Zapatero, Cvon Geldern, TW Benzoxazole benzenesulfonamides as allosteric inhibitors of fructose-1,6-bisphosphatase. Bioorg Med Chem Lett 16:1807-10 (2006)  
Target
Name:
Fructose-1,6-bisphosphatase 1
Synonyms:
D-fructose-1,6-bisphosphate 1-phosphohydrolase 1 FBP FBPase 1 Fructose-1,6-bisphosphatase 1 | Fructose-1,6-bisphosphatase 1 (FBPase)
Type:
Protein
Mol. Mass.:
36843.58
Organism:
Homo sapiens (Human)
Description:
Liver FBPase (P09467)
Residue:
338
  
Inhibitor
Name:
BDBM50181351
Synonyms:
2,5-dichloro-N-(6-methoxybenzo[d]oxazol-2-yl)benzenesulfonamide | CHEMBL206824
Type:
Small organic molecule
Emp. Form.:
C14H10Cl2N2O4S
Mol. Mass.:
373.211
SMILES:
COc1ccc2nc(NS(=O)(=O)c3cc(Cl)ccc3Cl)oc2c1
: