Target
Furin
Ligand
BDBM50601697
Substrate
Meas. Tech.
ChEMBL_2237970 (CHEMBL5151866)
Ki
0.170±n/a nM
Citation
 Osman, EEARehemtulla, ANeamati, N Why All the Fury over Furin? J Med Chem 65:2747-2784 (2022) Target
Name:
Furin
Synonyms:
FUR FURIN_HUMAN PACE | PCSK3
Type:
Enzyme Catalytic Domain
Mol. Mass.:
86676.01
Organism:
Homo sapiens (Human)
Description:
P09958
Residue:
794
  
Inhibitor
Name:
BDBM50601697
Synonyms:
CHEMBL5179893
Type:
Small organic molecule
Emp. Form.:
C34H52N12O4
Mol. Mass.:
692.8547
SMILES:
CC(C)(C)[C@H](NC(=O)[C@H](CCCNC(N)=N)NC(=O)Cc1ccccc1)C(=O)N[C@@H](CCCNC(N)=N)C(=O)NCc1ccc(cc1)C(N)=N
: