Target
Furin
Ligand
BDBM50601710
Substrate
Meas. Tech.
ChEMBL_2237971 (CHEMBL5151867)
Ki
0.504000±n/a nM
Citation
 Osman, EEARehemtulla, ANeamati, N Why All the Fury over Furin? J Med Chem 65:2747-2784 (2022) Target
Name:
Furin
Synonyms:
FUR FURIN_HUMAN PACE | PCSK3
Type:
Enzyme Catalytic Domain
Mol. Mass.:
86676.01
Organism:
Homo sapiens (Human)
Description:
P09958
Residue:
794
  
Inhibitor
Name:
BDBM50601710
Synonyms:
CHEMBL5175238
Type:
Small organic molecule
Emp. Form.:
C37H63N17O6
Mol. Mass.:
842.0064
SMILES:
NC(=N)NCCC[C@H](NC(=O)[C@@H]1CCCCNC(=O)CCCC(=O)N[C@@H](CCCNC(N)=N)C(=O)N[C@@H](CCCNC(N)=N)C(=O)N1)C(=O)NCc1ccc(cc1)C(N)=N
: