Target
Furin
Ligand
BDBM50601712
Substrate
Meas. Tech.
ChEMBL_2237971 (CHEMBL5151867)
Ki
0.110000±n/a nM
Citation
 Osman, EEARehemtulla, ANeamati, N Why All the Fury over Furin? J Med Chem 65:2747-2784 (2022) Target
Name:
Furin
Synonyms:
FUR FURIN_HUMAN PACE | PCSK3
Type:
Enzyme Catalytic Domain
Mol. Mass.:
86676.01
Organism:
Homo sapiens (Human)
Description:
P09958
Residue:
794
  
Inhibitor
Name:
BDBM50601712
Synonyms:
CHEMBL5207183
Type:
Small organic molecule
Emp. Form.:
C31H56N16O4
Mol. Mass.:
716.8811
SMILES:
CC(C)[C@H](NC(=O)[C@H](CCCNC(N)=N)NC(=O)[C@@H](N)CCCNC(N)=N)C(=O)N[C@@H](CCCNC(N)=N)C(=O)NCc1ccc(cc1)C(N)=N
: