Target
Furin
Ligand
BDBM50601715
Substrate
Meas. Tech.
ChEMBL_2237971 (CHEMBL5151867)
Ki
1.2±n/a nM
Citation
 Osman, EEARehemtulla, ANeamati, N Why All the Fury over Furin? J Med Chem 65:2747-2784 (2022) Target
Name:
Furin
Synonyms:
FUR FURIN_HUMAN PACE | PCSK3
Type:
Enzyme Catalytic Domain
Mol. Mass.:
86676.01
Organism:
Homo sapiens (Human)
Description:
P09958
Residue:
794
  
Inhibitor
Name:
BDBM50601715
Synonyms:
CHEMBL5189192
Type:
Small organic molecule
Emp. Form.:
C52H83N17O8
Mol. Mass.:
1074.3245
SMILES:
CC(C)(C)[C@@H]1NC(=O)[C@H](CCCNC(N)=N)NC(=O)[C@H](CCCNC(N)=N)NC(=O)[C@@H](N)CCCCNC(=O)Cc2ccc(CNC(=O)CCCC(=O)NCCCC[C@H](NC1=O)C(=O)NCc1ccc(cc1)C(N)=N)cc2
: