Target
Furin
Ligand
BDBM50601716
Substrate
Meas. Tech.
ChEMBL_2237971 (CHEMBL5151867)
Ki
0.053800±n/a nM
Citation
 Osman, EEARehemtulla, ANeamati, N Why All the Fury over Furin? J Med Chem 65:2747-2784 (2022) Target
Name:
Furin
Synonyms:
FUR FURIN_HUMAN PACE | PCSK3
Type:
Enzyme Catalytic Domain
Mol. Mass.:
86676.01
Organism:
Homo sapiens (Human)
Description:
P09958
Residue:
794
  
Inhibitor
Name:
BDBM50601716
Synonyms:
CHEMBL5207759
Type:
Small organic molecule
Emp. Form.:
C70H105N27O10
Mol. Mass.:
1484.7576
SMILES:
NC(=N)NCCC[C@H](NC(=O)[C@@H]1CCCCNC(=O)CCC(=O)N[C@@H](Cc2ccccc2)C(=O)N[C@@H](Cc2ccc3ccccc3c2)C(=O)N[C@@H](CCCNC(N)=N)C(=O)N[C@@H](CCCNC(N)=N)C(=O)N[C@@H](CCCNC(N)=N)C(=O)N[C@@H](CCCNC(N)=N)C(=O)N1)C(=O)NCc1ccc(cc1)C(N)=N
: