Target
HLA class II histocompatibility antigen gamma chain
Ligand
BDBM50182094
Substrate
Meas. Tech.
ChEMBL_347360 (CHEMBL865649)
IC50
2000±n/a nM
Citation
 Grice, CATays, KKhatuya, HGustin, DJButler, CRWei, JSehon, CASun, SGu, YJiang, WThurmond, RLKarlsson, LEdwards, JP The SAR of 4-substituted (6,6-bicyclic) piperidine cathepsin S inhibitors. Bioorg Med Chem Lett 16:2209-12 (2006)  
Target
Name:
HLA class II histocompatibility antigen gamma chain
Synonyms:
CD74 HG2A_HUMAN | HLA-DR antigens-associated invariant chain
Type:
PROTEIN
Mol. Mass.:
33525.85
Organism:
Homo sapiens (Human)
Description:
ChEMBL_347360
Residue:
296
  
Inhibitor
Name:
BDBM50182094
Synonyms:
5-methyl-4-(1-(3-(5-(methylsulfonyl)-3-(4-(trifluoromethyl)phenyl)-4,5,6,7-tetrahydropyrazolo[4,3-c]pyridin-1-yl)propyl)piperidin-4-yl)-2H-benzo[b][1,4]oxazin-3(4H)-one | CHEMBL379351
Type:
Small organic molecule
Emp. Form.:
C31H36F3N5O4S
Mol. Mass.:
631.709
SMILES:
Cc1cccc2OCC(=O)N(C3CCN(CCCn4nc(c5CN(CCc45)S(C)(=O)=O)-c4ccc(cc4)C(F)(F)F)CC3)c12
: