Target
HLA class II histocompatibility antigen gamma chain
Ligand
BDBM50182106
Substrate
Meas. Tech.
ChEMBL_347360 (CHEMBL865649)
IC50
1600±n/a nM
Citation
 Grice, CATays, KKhatuya, HGustin, DJButler, CRWei, JSehon, CASun, SGu, YJiang, WThurmond, RLKarlsson, LEdwards, JP The SAR of 4-substituted (6,6-bicyclic) piperidine cathepsin S inhibitors. Bioorg Med Chem Lett 16:2209-12 (2006)  
Target
Name:
HLA class II histocompatibility antigen gamma chain
Synonyms:
CD74 HG2A_HUMAN | HLA-DR antigens-associated invariant chain
Type:
PROTEIN
Mol. Mass.:
33525.85
Organism:
Homo sapiens (Human)
Description:
ChEMBL_347360
Residue:
296
  
Inhibitor
Name:
BDBM50182106
Synonyms:
4-(1-(3-(3-(4-bromophenyl)-5-(methylsulfonyl)-4,5,6,7-tetrahydropyrazolo[4,3-c]pyridin-1-yl)propyl)piperidin-4-yl)-5-methyl-2H-benzo[b][1,4]oxazin-3(4H)-one | CHEMBL380361
Type:
Small organic molecule
Emp. Form.:
C30H36BrN5O4S
Mol. Mass.:
642.607
SMILES:
Cc1cccc2OCC(=O)N(C3CCN(CCCn4nc(c5CN(CCc45)S(C)(=O)=O)-c4ccc(Br)cc4)CC3)c12
: