Target
Sodium/bile acid cotransporter
Ligand
BDBM50088504
Substrate
Meas. Tech.
ChEMBL_2238512 (CHEMBL5152408)
Ki
18400±n/a nM
Citation
 Chen, SZhang, LChen, YFu, L Inhibiting Sodium Taurocholate Cotransporting Polypeptide in HBV-Related Diseases: From Biological Function to Therapeutic Potential. J Med Chem 65:12546-12561 (2022) Target
Name:
Sodium/bile acid cotransporter
Synonyms:
Bile acid transporter NTCP_HUMAN | SLC10A1
Type:
PROTEIN
Mol. Mass.:
38131.81
Organism:
Homo sapiens (Human)
Description:
ChEMBL_838517
Residue:
349
  
Inhibitor
Name:
BDBM50088504
Synonyms:
A-84538 CHEBI:45409 Ritonavir
Type:
Small organic molecule
Emp. Form.:
C37H48N6O5S2
Mol. Mass.:
720.944
SMILES:
CC(C)[C@H](NC(=O)N(C)Cc1csc(n1)C(C)C)C(=O)N[C@H](C[C@H](O)[C@H](Cc1ccccc1)NC(=O)OCc1cncs1)Cc1ccccc1
: