Target
Sodium/bile acid cotransporter
Ligand
BDBM50601888
Substrate
Meas. Tech.
ChEMBL_2238516 (CHEMBL5152412)
IC50
6000±n/a nM
Citation
 Chen, SZhang, LChen, YFu, L Inhibiting Sodium Taurocholate Cotransporting Polypeptide in HBV-Related Diseases: From Biological Function to Therapeutic Potential. J Med Chem 65:12546-12561 (2022) Target
Name:
Sodium/bile acid cotransporter
Synonyms:
Bile acid transporter NTCP_HUMAN | SLC10A1
Type:
PROTEIN
Mol. Mass.:
38131.81
Organism:
Homo sapiens (Human)
Description:
ChEMBL_838517
Residue:
349
  
Inhibitor
Name:
BDBM50601888
Synonyms:
Betulin-3-Caffeate CHEMBL502663
Type:
Small organic molecule
Emp. Form.:
C39H56O5
Mol. Mass.:
604.8589
SMILES:
[H][C@]12[C@@H](CC[C@]1(CO)CC[C@]1(C)[C@]2([H])CC[C@]2([H])[C@@]3(C)CC[C@H](OC(=O)\C=C\c4ccc(O)c(O)c4)C(C)(C)[C@]3([H])CC[C@@]12C)C(C)=C
: